{"text_format":"3","workbook":"xlsx","n_sheets":3,"sheets":["Sheet1","Sheet2","Sheet3"],"not_rendered":{"external_links":1,"comments":1},"read":"whole","date_system":"1900"}

{"sheet":"Sheet1","index":0,"n_rows":222,"n_cols":10,"rows_kept":222}
["Id(int)","SceneType(int)","Name(str)","Exp(int)","Multiple(arrint)","Path(arrint)","Count(arrint)","RefreshInterval(int)","Speed(int)","Event(int)"]
["类型","场次类型","名字","经验","倍数","路径随机","出鱼数量","出鱼间隔(毫秒)","速度修正","事件"]
[3001,1,"小虾米",{"$f":"VLOOKUP(A3,[1]DB_Fish!$A:$G,7,FALSE)","v":10},{"$f":"VLOOKUP(A3,[1]DB_Fish!A:D,4,FALSE)","v":"1|1"},"1|1","1|1",200,0,0]
[1001,1,"小刺鱼",{"$f":"VLOOKUP(A4,[1]DB_Fish!$A:$G,7,FALSE)","v":10},{"$f":"VLOOKUP(A4,[1]DB_Fish!A:D,4,FALSE)","v":"2|2"},"1|1","1|1",{"$f":"H3+200","v":400},0,0]
[1002,1,"小草鱼",{"$f":"VLOOKUP(A5,[1]DB_Fish!$A:$G,7,FALSE)","v":10},{"$f":"VLOOKUP(A5,[1]DB_Fish!A:D,4,FALSE)","v":"2|2"},"1|1","1|1",{"$f":"H4+200","v":600},0,0]
[7001,1,"小彩鱼",{"$f":"VLOOKUP(A6,[1]DB_Fish!$A:$G,7,FALSE)","v":10},{"$f":"VLOOKUP(A6,[1]DB_Fish!A:D,4,FALSE)","v":"2|2"},"1|1","1|1",800,0,0]
[7002,1,"天使鱼",{"$f":"VLOOKUP(A7,[1]DB_Fish!$A:$G,7,FALSE)","v":10},{"$f":"VLOOKUP(A7,[1]DB_Fish!A:D,4,FALSE)","v":"2|2"},"1|1","1|1",1000,0,0]
[21001,1,"鲽鱼",{"$f":"VLOOKUP(A8,[1]DB_Fish!$A:$G,7,FALSE)","v":10},{"$f":"VLOOKUP(A8,[1]DB_Fish!A:D,4,FALSE)","v":"2|2"},"1|1","1|1",1200,0,0]
[3002,1,"小草鱼",{"$f":"VLOOKUP(A9,[1]DB_Fish!$A:$G,7,FALSE)","v":10},{"$f":"VLOOKUP(A9,[1]DB_Fish!A:D,4,FALSE)","v":"2|2"},"1|1","1|1",1400,0,0]
[5001,1,"小刺鱼",{"$f":"VLOOKUP(A10,[1]DB_Fish!$A:$G,7,FALSE)","v":10},{"$f":"VLOOKUP(A10,[1]DB_Fish!A:D,4,FALSE)","v":"2|2"},"1|1","1|1",1600,0,0]
[5002,1,"小草鱼",{"$f":"VLOOKUP(A11,[1]DB_Fish!$A:$G,7,FALSE)","v":10},{"$f":"VLOOKUP(A11,[1]DB_Fish!A:D,4,FALSE)","v":"2|2"},"1|1","1|1",1800,0,0]
[11001,1,"沙丁鱼",{"$f":"VLOOKUP(A12,[1]DB_Fish!$A:$G,7,FALSE)","v":10},{"$f":"VLOOKUP(A12,[1]DB_Fish!A:D,4,FALSE)","v":"2|2"},"1|1","1|1",2000,0,0]
[11002,1,"小丑鱼",{"$f":"VLOOKUP(A13,[1]DB_Fish!$A:$G,7,FALSE)","v":10},{"$f":"VLOOKUP(A13,[1]DB_Fish!A:D,4,FALSE)","v":"2|2"},"1|1","1|1",2200,0,0]
[1003,1,"小黄鱼",{"$f":"VLOOKUP(A14,[1]DB_Fish!$A:$G,7,FALSE)","v":10},{"$f":"VLOOKUP(A14,[1]DB_Fish!A:D,4,FALSE)","v":"3|3"},"1|1","1|1",2400,0,0]
[7003,1,"小黄鱼",{"$f":"VLOOKUP(A15,[1]DB_Fish!$A:$G,7,FALSE)","v":10},{"$f":"VLOOKUP(A15,[1]DB_Fish!A:D,4,FALSE)","v":"3|3"},"1|1","1|1",2600,0,0]
[7004,1,"车旗鱼",{"$f":"VLOOKUP(A16,[1]DB_Fish!$A:$G,7,FALSE)","v":10},{"$f":"VLOOKUP(A16,[1]DB_Fish!A:D,4,FALSE)","v":"3|3"},"1|1","1|1",2800,0,0]
[21002,1,"虾虎鱼",{"$f":"VLOOKUP(A17,[1]DB_Fish!$A:$G,7,FALSE)","v":10},{"$f":"VLOOKUP(A17,[1]DB_Fish!A:D,4,FALSE)","v":"3|3"},"1|1","1|1",3000,0,0]
[5003,1,"小黄鱼",{"$f":"VLOOKUP(A18,[1]DB_Fish!$A:$G,7,FALSE)","v":10},{"$f":"VLOOKUP(A18,[1]DB_Fish!A:D,4,FALSE)","v":"3|3"},"1|1","1|1",3200,0,0]
[11003,1,"蓝藻鱼",{"$f":"VLOOKUP(A19,[1]DB_Fish!$A:$G,7,FALSE)","v":10},{"$f":"VLOOKUP(A19,[1]DB_Fish!A:D,4,FALSE)","v":"3|3"},"1|1","1|1",3400,0,0]
[7005,1,"蓝金枪鱼",{"$f":"VLOOKUP(A20,[1]DB_Fish!$A:$G,7,FALSE)","v":10},{"$f":"VLOOKUP(A20,[1]DB_Fish!A:D,4,FALSE)","v":"4|4"},"1|1","1|1",3600,0,0]
[7006,1,"小丑鱼",{"$f":"VLOOKUP(A21,[1]DB_Fish!$A:$G,7,FALSE)","v":10},{"$f":"VLOOKUP(A21,[1]DB_Fish!A:D,4,FALSE)","v":"4|4"},"1|1","1|1",3800,0,0]
[21003,1,"兔子鱼",{"$f":"VLOOKUP(A22,[1]DB_Fish!$A:$G,7,FALSE)","v":10},{"$f":"VLOOKUP(A22,[1]DB_Fish!A:D,4,FALSE)","v":"4|4"},"1|1","1|1",4000,0,0]
[1004,1,"泡泡鱼",{"$f":"VLOOKUP(A23,[1]DB_Fish!$A:$G,7,FALSE)","v":10},{"$f":"VLOOKUP(A23,[1]DB_Fish!A:D,4,FALSE)","v":"4|4"},"1|1","1|1",4200,0,0]
[3003,1,"小黄鱼",{"$f":"VLOOKUP(A24,[1]DB_Fish!$A:$G,7,FALSE)","v":10},{"$f":"VLOOKUP(A24,[1]DB_Fish!A:D,4,FALSE)","v":"4|4"},"1|1","1|1",4400,0,0]
[5004,1,"泡泡鱼",{"$f":"VLOOKUP(A25,[1]DB_Fish!$A:$G,7,FALSE)","v":10},{"$f":"VLOOKUP(A25,[1]DB_Fish!A:D,4,FALSE)","v":"4|4"},"1|1","1|1",4600,0,0]
[11004,1,"红斗鱼",{"$f":"VLOOKUP(A26,[1]DB_Fish!$A:$G,7,FALSE)","v":10},{"$f":"VLOOKUP(A26,[1]DB_Fish!A:D,4,FALSE)","v":"4|4"},"1|1","1|1",4800,0,0]
[11005,1,"蓝斗鱼",{"$f":"VLOOKUP(A27,[1]DB_Fish!$A:$G,7,FALSE)","v":10},{"$f":"VLOOKUP(A27,[1]DB_Fish!A:D,4,FALSE)","v":"4|4"},"1|1","1|1",5000,0,0]
[7007,1,"小乌贼",{"$f":"VLOOKUP(A28,[1]DB_Fish!$A:$G,7,FALSE)","v":10},{"$f":"VLOOKUP(A28,[1]DB_Fish!A:D,4,FALSE)","v":"5|5"},"1|1","1|1",5200,0,0]
[7008,1,"星光鱼",{"$f":"VLOOKUP(A29,[1]DB_Fish!$A:$G,7,FALSE)","v":10},{"$f":"VLOOKUP(A29,[1]DB_Fish!A:D,4,FALSE)","v":"5|5"},"1|1","1|1",5400,0,0]
[21004,1,"小丑鱼",{"$f":"VLOOKUP(A30,[1]DB_Fish!$A:$G,7,FALSE)","v":10},{"$f":"VLOOKUP(A30,[1]DB_Fish!A:D,4,FALSE)","v":"5|5"},"1|1","1|1",5600,0,0]
[1005,1,"小紫鱼",{"$f":"VLOOKUP(A31,[1]DB_Fish!$A:$G,7,FALSE)","v":10},{"$f":"VLOOKUP(A31,[1]DB_Fish!A:D,4,FALSE)","v":"5|5"},"1|1","1|1",5800,0,0]
[3004,1,"泡泡鱼",{"$f":"VLOOKUP(A32,[1]DB_Fish!$A:$G,7,FALSE)","v":10},{"$f":"VLOOKUP(A32,[1]DB_Fish!A:D,4,FALSE)","v":"5|5"},"1|1","1|1",6000,0,0]
[5005,1,"小紫鱼",{"$f":"VLOOKUP(A33,[1]DB_Fish!$A:$G,7,FALSE)","v":10},{"$f":"VLOOKUP(A33,[1]DB_Fish!A:D,4,FALSE)","v":"5|5"},"1|1","1|1",6200,0,0]
[11006,1,"小墨鱼",{"$f":"VLOOKUP(A34,[1]DB_Fish!$A:$G,7,FALSE)","v":10},{"$f":"VLOOKUP(A34,[1]DB_Fish!A:D,4,FALSE)","v":"5|5"},"1|1","1|1",6400,0,0]
[11007,1,"气球鱼",{"$f":"VLOOKUP(A35,[1]DB_Fish!$A:$G,7,FALSE)","v":10},{"$f":"VLOOKUP(A35,[1]DB_Fish!A:D,4,FALSE)","v":"5|5"},"1|1","1|1",6600,0,0]
[7009,1,"小螃蟹",{"$f":"VLOOKUP(A36,[1]DB_Fish!$A:$G,7,FALSE)","v":10},{"$f":"VLOOKUP(A36,[1]DB_Fish!A:D,4,FALSE)","v":"6|6"},"1|1","1|1",6800,0,0]
[7010,1,"龙虾",{"$f":"VLOOKUP(A37,[1]DB_Fish!$A:$G,7,FALSE)","v":10},{"$f":"VLOOKUP(A37,[1]DB_Fish!A:D,4,FALSE)","v":"6|6"},"1|1","1|1",7000,0,0]
[21005,1,"神仙鱼",{"$f":"VLOOKUP(A38,[1]DB_Fish!$A:$G,7,FALSE)","v":10},{"$f":"VLOOKUP(A38,[1]DB_Fish!A:D,4,FALSE)","v":"6|6"},"1|1","1|1",7200,0,0]
[3005,1,"小紫鱼",{"$f":"VLOOKUP(A39,[1]DB_Fish!$A:$G,7,FALSE)","v":10},{"$f":"VLOOKUP(A39,[1]DB_Fish!A:D,4,FALSE)","v":"6|6"},"1|1","1|1",7400,0,0]
[1006,1,"尼莫",{"$f":"VLOOKUP(A40,[1]DB_Fish!$A:$G,7,FALSE)","v":10},{"$f":"VLOOKUP(A40,[1]DB_Fish!A:D,4,FALSE)","v":"6|6"},"1|1","1|1",7600,0,0]
[5006,1,"尼莫",{"$f":"VLOOKUP(A41,[1]DB_Fish!$A:$G,7,FALSE)","v":10},{"$f":"VLOOKUP(A41,[1]DB_Fish!A:D,4,FALSE)","v":"6|6"},"1|1","1|1",7800,0,0]
[7011,1,"深海鱿鱼",{"$f":"VLOOKUP(A42,[1]DB_Fish!$A:$G,7,FALSE)","v":10},{"$f":"VLOOKUP(A42,[1]DB_Fish!A:D,4,FALSE)","v":"7|7"},"1|1","1|1",8000,0,0]
[21006,1,"孔雀鱼",{"$f":"VLOOKUP(A43,[1]DB_Fish!$A:$G,7,FALSE)","v":10},{"$f":"VLOOKUP(A43,[1]DB_Fish!A:D,4,FALSE)","v":"7|7"},"1|1","1|1",8200,0,0]
[3006,1,"尼莫",{"$f":"VLOOKUP(A44,[1]DB_Fish!$A:$G,7,FALSE)","v":10},{"$f":"VLOOKUP(A44,[1]DB_Fish!A:D,4,FALSE)","v":"7|7"},"1|1","1|1",8400,0,0]
[1007,1,"河豚",{"$f":"VLOOKUP(A45,[1]DB_Fish!$A:$G,7,FALSE)","v":10},{"$f":"VLOOKUP(A45,[1]DB_Fish!A:D,4,FALSE)","v":"7|7"},"1|1","1|1",8600,0,0]
[5007,1,"河豚",{"$f":"VLOOKUP(A46,[1]DB_Fish!$A:$G,7,FALSE)","v":10},{"$f":"VLOOKUP(A46,[1]DB_Fish!A:D,4,FALSE)","v":"7|7"},"1|1","1|1",8800,0,0]
[21007,1,"星鱼",{"$f":"VLOOKUP(A47,[1]DB_Fish!$A:$G,7,FALSE)","v":10},{"$f":"VLOOKUP(A47,[1]DB_Fish!A:D,4,FALSE)","v":"8|8"},"1|1","1|1",9000,0,0]
[3007,1,"河豚",{"$f":"VLOOKUP(A48,[1]DB_Fish!$A:$G,7,FALSE)","v":10},{"$f":"VLOOKUP(A48,[1]DB_Fish!A:D,4,FALSE)","v":"8|8"},"1|1","1|1",9200,0,0]
[1008,1,"蓝鱼",{"$f":"VLOOKUP(A49,[1]DB_Fish!$A:$G,7,FALSE)","v":10},{"$f":"VLOOKUP(A49,[1]DB_Fish!A:D,4,FALSE)","v":"8|8"},"1|1","1|1",9400,0,0]
[5008,1,"蓝鱼",{"$f":"VLOOKUP(A50,[1]DB_Fish!$A:$G,7,FALSE)","v":10},{"$f":"VLOOKUP(A50,[1]DB_Fish!A:D,4,FALSE)","v":"8|8"},"1|1","1|1",9600,0,0]
[11008,1,"粉水母",{"$f":"VLOOKUP(A51,[1]DB_Fish!$A:$G,7,FALSE)","v":10},{"$f":"VLOOKUP(A51,[1]DB_Fish!A:D,4,FALSE)","v":"8|8"},"1|1","1|1",9800,0,0]
[11009,1,"螃蟹",{"$f":"VLOOKUP(A52,[1]DB_Fish!$A:$G,7,FALSE)","v":10},{"$f":"VLOOKUP(A52,[1]DB_Fish!A:D,4,FALSE)","v":"8|8"},"1|1","1|1",10000,0,0]
[5009,1,"灯笼鱼",{"$f":"VLOOKUP(A53,[1]DB_Fish!$A:$G,7,FALSE)","v":10},{"$f":"VLOOKUP(A53,[1]DB_Fish!A:D,4,FALSE)","v":"9|9"},"1|1","1|1",10200,0,0]
[1009,1,"灯笼鱼",{"$f":"VLOOKUP(A54,[1]DB_Fish!$A:$G,7,FALSE)","v":10},{"$f":"VLOOKUP(A54,[1]DB_Fish!A:D,4,FALSE)","v":"9|9"},"1|1","1|1",10400,0,0]
[1016,1,"海草",{"$f":"VLOOKUP(A55,[1]DB_Fish!$A:$G,7,FALSE)","v":10},{"$f":"VLOOKUP(A55,[1]DB_Fish!A:D,4,FALSE)","v":"10|10"},"1|1","1|1",10600,0,0]
[7012,1,"大眼鱼",{"$f":"VLOOKUP(A56,[1]DB_Fish!$A:$G,7,FALSE)","v":10},{"$f":"VLOOKUP(A56,[1]DB_Fish!A:D,4,FALSE)","v":"10|10"},"1|1","1|1",10800,0,0]
[21008,1,"海马",{"$f":"VLOOKUP(A57,[1]DB_Fish!$A:$G,7,FALSE)","v":10},{"$f":"VLOOKUP(A57,[1]DB_Fish!A:D,4,FALSE)","v":"10|10"},"1|1","1|1",11000,0,0]
[21009,1,"宝石鱼",{"$f":"VLOOKUP(A58,[1]DB_Fish!$A:$G,7,FALSE)","v":10},{"$f":"VLOOKUP(A58,[1]DB_Fish!A:D,4,FALSE)","v":"10|10"},"1|1","1|1",11200,0,0]
[3008,1,"蓝鱼",{"$f":"VLOOKUP(A59,[1]DB_Fish!$A:$G,7,FALSE)","v":10},{"$f":"VLOOKUP(A59,[1]DB_Fish!A:D,4,FALSE)","v":"10|10"},"1|1","1|1",11400,0,0]
[5010,1,"乌龟",{"$f":"VLOOKUP(A60,[1]DB_Fish!$A:$G,7,FALSE)","v":10},{"$f":"VLOOKUP(A60,[1]DB_Fish!A:D,4,FALSE)","v":"10|10"},"1|1","1|1",11600,0,0]
[5016,1,"海草",{"$f":"VLOOKUP(A61,[1]DB_Fish!$A:$G,7,FALSE)","v":10},{"$f":"VLOOKUP(A61,[1]DB_Fish!A:D,4,FALSE)","v":"10|10"},"1|1","1|1",11800,0,0]
[1010,1,"乌龟",{"$f":"VLOOKUP(A62,[1]DB_Fish!$A:$G,7,FALSE)","v":10},{"$f":"VLOOKUP(A62,[1]DB_Fish!A:D,4,FALSE)","v":"10|10"},"1|1","1|1",12000,0,0]
[11010,1,"灯笼鱼",{"$f":"VLOOKUP(A63,[1]DB_Fish!$A:$G,7,FALSE)","v":10},{"$f":"VLOOKUP(A63,[1]DB_Fish!A:D,4,FALSE)","v":"10|10"},"1|1","1|1",12200,0,0]
[11011,1,"乌龟",{"$f":"VLOOKUP(A64,[1]DB_Fish!$A:$G,7,FALSE)","v":10},{"$f":"VLOOKUP(A64,[1]DB_Fish!A:D,4,FALSE)","v":"10|10"},"1|1","1|1",12400,0,0]
[7013,1,"蝴蝶鱼",{"$f":"VLOOKUP(A65,[1]DB_Fish!$A:$G,7,FALSE)","v":10},{"$f":"VLOOKUP(A65,[1]DB_Fish!A:D,4,FALSE)","v":"12|12"},"1|1","1|1",12600,0,0]
[3009,1,"灯笼鱼",{"$f":"VLOOKUP(A66,[1]DB_Fish!$A:$G,7,FALSE)","v":10},{"$f":"VLOOKUP(A66,[1]DB_Fish!A:D,4,FALSE)","v":"12|12"},"1|1","1|1",12800,0,0]
[5011,1,"神仙鱼",{"$f":"VLOOKUP(A67,[1]DB_Fish!$A:$G,7,FALSE)","v":10},{"$f":"VLOOKUP(A67,[1]DB_Fish!A:D,4,FALSE)","v":"12|12"},"1|1","1|1",13000,0,0]
[1011,1,"神仙鱼",{"$f":"VLOOKUP(A68,[1]DB_Fish!$A:$G,7,FALSE)","v":10},{"$f":"VLOOKUP(A68,[1]DB_Fish!A:D,4,FALSE)","v":"12|12"},"1|1","1|1",13200,0,0]
[11012,1,"神仙鱼",{"$f":"VLOOKUP(A69,[1]DB_Fish!$A:$G,7,FALSE)","v":10},{"$f":"VLOOKUP(A69,[1]DB_Fish!A:D,4,FALSE)","v":"12|12"},"1|1","1|1",{"$f":"H68+200","v":13400},0,0]
[7014,1,"魔鬼鱼",{"$f":"VLOOKUP(A70,[1]DB_Fish!$A:$G,7,FALSE)","v":10},{"$f":"VLOOKUP(A70,[1]DB_Fish!A:D,4,FALSE)","v":"14|14"},"1|1","1|1",13600,0,0]
[11013,1,"蝴蝶鱼",{"$f":"VLOOKUP(A71,[1]DB_Fish!$A:$G,7,FALSE)","v":10},{"$f":"VLOOKUP(A71,[1]DB_Fish!A:D,4,FALSE)","v":"14|14"},"1|1","1|1",13800,0,0]
[1012,1,"蝴蝶鱼",{"$f":"VLOOKUP(A72,[1]DB_Fish!$A:$G,7,FALSE)","v":10},{"$f":"VLOOKUP(A72,[1]DB_Fish!A:D,4,FALSE)","v":"15|15"},"1|1","1|1",14000,0,0]
[8001,1,"冰冻鱼",{"$f":"VLOOKUP(A73,[1]DB_Fish!$A:$G,7,FALSE)","v":10},{"$f":"VLOOKUP(A73,[1]DB_Fish!A:D,4,FALSE)","v":"15|15"},"1|1","1|1",14200,0,0]
[21011,1,"食人鱼",{"$f":"VLOOKUP(A74,[1]DB_Fish!$A:$G,7,FALSE)","v":10},{"$f":"VLOOKUP(A74,[1]DB_Fish!A:D,4,FALSE)","v":"15|15"},"1|1","1|1",14400,0,0]
[3010,1,"乌龟",{"$f":"VLOOKUP(A75,[1]DB_Fish!$A:$G,7,FALSE)","v":10},{"$f":"VLOOKUP(A75,[1]DB_Fish!A:D,4,FALSE)","v":"15|15"},"1|1","1|1",14600,0,0]
[5012,1,"蝴蝶鱼",{"$f":"VLOOKUP(A76,[1]DB_Fish!$A:$G,7,FALSE)","v":10},{"$f":"VLOOKUP(A76,[1]DB_Fish!A:D,4,FALSE)","v":"15|15"},"1|1","1|1",14800,0,0]
[7015,1,"灯笼鱼",{"$f":"VLOOKUP(A77,[1]DB_Fish!$A:$G,7,FALSE)","v":10},{"$f":"VLOOKUP(A77,[1]DB_Fish!A:D,4,FALSE)","v":"16|16"},"1|1","1|1",15000,0,0]
[11014,1,"海星",{"$f":"VLOOKUP(A78,[1]DB_Fish!$A:$G,7,FALSE)","v":10},{"$f":"VLOOKUP(A78,[1]DB_Fish!A:D,4,FALSE)","v":"16|16"},"1|1","1|1",15200,0,0]
[11015,1,"剑鱼",{"$f":"VLOOKUP(A79,[1]DB_Fish!$A:$G,7,FALSE)","v":10},{"$f":"VLOOKUP(A79,[1]DB_Fish!A:D,4,FALSE)","v":"18|18"},"1|1","1|1",15400,0,0]
[1013,1,"孔雀鱼",{"$f":"VLOOKUP(A80,[1]DB_Fish!$A:$G,7,FALSE)","v":10},{"$f":"VLOOKUP(A80,[1]DB_Fish!A:D,4,FALSE)","v":"18|18"},"1|1","1|1",15600,0,0]
{"$rows_left_out":143}
{"sheet":"Sheet2","index":1,"n_rows":208,"n_cols":16,"rows_kept":208}
["新手渔村",1,null,"编号","名称","名称英文","金币",null,null,1001,"小刺鱼",1,2,null,1001,"小刺鱼"]
["藏宝秘境",2,null,1001,"小刺鱼",1,2,null,null,1002,"小草鱼",1,2,null,1002,"小草鱼"]
["东海龙宫",3,null,1002,"小草鱼",1,2,null,null,1003,"小黄鱼",1,3,null,1003,"小黄鱼"]
["海怪深渊",4,null,1003,"小黄鱼",1,3,null,null,1004,"泡泡鱼",1,4,null,1004,"泡泡鱼"]
[{"$nulls":3},1004,"泡泡鱼",1,4,null,null,1005,"小紫鱼",1,5,null,1005,"小紫鱼"]
[{"$nulls":3},1005,"小紫鱼",1,5,null,null,1006,"尼莫",1,6,null,1006,"尼莫"]
[{"$nulls":3},1006,"尼莫",1,6,null,null,1007,"河豚",1,7,null,1007,"河豚"]
[{"$nulls":3},1007,"河豚",1,7,null,null,1008,"蓝鱼",1,8,null,1008,"蓝鱼"]
[{"$nulls":3},1008,"蓝鱼",1,8,null,null,1009,"灯笼鱼",1,9,null,1009,"灯笼鱼"]
[{"$nulls":3},1009,"灯笼鱼",1,9,null,null,1010,"乌龟",1,10,null,1010,"乌龟"]
[{"$nulls":3},1010,"乌龟",1,10,null,null,1011,"神仙鱼",1,12,null,1011,"神仙鱼"]
[{"$nulls":3},1011,"神仙鱼",1,12,null,null,1012,"蝴蝶鱼",1,15,null,1012,"蝴蝶鱼"]
[{"$nulls":3},1012,"蝴蝶鱼",1,15,null,null,1013,"孔雀鱼",1,18,null,1013,"孔雀鱼"]
[{"$nulls":3},1013,"孔雀鱼",1,18,null,null,1014,"剑鱼",1,20,null,1014,"剑鱼"]
[{"$nulls":3},1014,"剑鱼",1,20,null,null,1015,"蝙蝠鱼",1,25,null,1015,"蝙蝠鱼"]
[{"$nulls":3},1015,"蝙蝠鱼",1,25,null,null,1016,"海草",1,10,null,1016,"海草"]
[{"$nulls":3},1016,"海草",1,10,null,null,1017,"大白鲨",1,30,null,1017,"大白鲨"]
[{"$nulls":3},1017,"大白鲨",1,30,null,null,1018,"大金鲨",1,40,null,1018,"大金鲨"]
[{"$nulls":3},1018,"大金鲨",1,40,null,null,1051,"金鲸",1,150,null,1051,"金鲸"]
[{"$nulls":3},1051,"金鲸",1,150,null,null,1052,"企鹅",1,220,null,1052,"企鹅"]
[{"$nulls":3},1052,"企鹅",1,220,null,null,1053,"银龙",1,70,null,1053,"银龙"]
[{"$nulls":3},1053,"银龙",1,70,null,null,1054,"金龙",1,180,null,1054,"金龙"]
[{"$nulls":3},1054,"金龙",1,180,null,null,2001,"全屏炸弹(七星剑)",1,100,null,2001,"全屏炸弹(七星剑)"]
[{"$nulls":3},2001,"全屏炸弹(七星剑)",1,100,null,null,2002,"定屏炸弹(忠义堂)",1,100,null,2002,"定屏炸弹(忠义堂)"]
[{"$nulls":3},2002,"定屏炸弹(忠义堂)",1,100,null,null,2003,"局部炸弹(水浒传)",1,100,null,2003,"局部炸弹(水浒传)"]
[{"$nulls":3},2003,"局部炸弹(水浒传)",1,100,null,null,2051,"一种同类鱼",1,100,null,2004,"李逵"]
[{"$nulls":3},2004,"李逵",1,300,null,null,2052,"五种同类鱼",1,100,null,2051,"一种同类鱼"]
[{"$nulls":3},2051,"一种同类鱼",1,100,{"$nulls":7},2052,"五种同类鱼"]
[{"$nulls":3},2052,"五种同类鱼",1,100,{"$nulls":7},3001,"小虾米"]
[{"$nulls":3},3001,"小虾米",null,1,{"$nulls":7},3002,"小草鱼"]
[{"$nulls":3},3002,"小草鱼",1,2,{"$nulls":7},3003,"小黄鱼"]
[{"$nulls":3},3003,"小黄鱼",1,4,{"$nulls":7},3004,"泡泡鱼"]
[{"$nulls":3},3004,"泡泡鱼",1,5,{"$nulls":7},3005,"小紫鱼"]
[{"$nulls":3},3005,"小紫鱼",1,6,{"$nulls":7},3006,"尼莫"]
[{"$nulls":3},3006,"尼莫",1,7,{"$nulls":7},3007,"河豚"]
[{"$nulls":3},3007,"河豚",1,8,{"$nulls":7},3008,"蓝鱼"]
[{"$nulls":3},3008,"蓝鱼",1,10,{"$nulls":7},3009,"灯笼鱼"]
[{"$nulls":3},3009,"灯笼鱼",1,12,{"$nulls":7},3010,"乌龟"]
[{"$nulls":3},3010,"乌龟",1,15,{"$nulls":7},3011,"神仙鱼"]
[{"$nulls":3},3011,"神仙鱼",1,18,{"$nulls":7},3012,"剑鱼"]
[{"$nulls":3},3012,"剑鱼",1,20,{"$nulls":7},3013,"蝙蝠鱼"]
[{"$nulls":3},3013,"蝙蝠鱼",1,25,{"$nulls":7},3014,"大白鲨"]
[{"$nulls":3},3014,"大白鲨",1,30,{"$nulls":7},3015,"大金鲨"]
[{"$nulls":3},3015,"大金鲨",1,35,{"$nulls":7},3051,"船"]
[{"$nulls":3},3051,"船",1,50,{"$nulls":7},3052,"美人鱼"]
[{"$nulls":3},3052,"美人鱼",1,75,{"$nulls":7},3053,"银龙"]
[{"$nulls":3},3053,"银龙",1,100,{"$nulls":7},3054,"金龙"]
[{"$nulls":3},3054,"金龙",1,120,{"$nulls":7},4001,"孙悟空"]
[{"$nulls":3},4001,"孙悟空",1,180,{"$nulls":7},4002,"玉皇大帝"]
[{"$nulls":3},4002,"玉皇大帝",1,200,{"$nulls":7},4003,"全屏炸弹(万佛朝宗)"]
[{"$nulls":3},4003,"全屏炸弹(万佛朝宗)",1,100,{"$nulls":7},4004,"随机效果(炼丹炉)"]
[{"$nulls":3},4004,"随机效果(炼丹炉)",1,100,{"$nulls":7},4051,"一种同类鱼"]
[{"$nulls":3},4051,"一种同类鱼",1,100,{"$nulls":7},4052,"两种同类鱼"]
[{"$nulls":3},4052,"两种同类鱼",1,100,{"$nulls":7},4053,"三种同类鱼"]
[{"$nulls":3},4053,"三种同类鱼",1,100,{"$nulls":7},5001,"小刺鱼"]
[{"$nulls":3},5051,"企鹅",1,50,{"$nulls":7},5002,"小草鱼"]
[{"$nulls":3},5052,"蓝海豚",null,60,{"$nulls":7},5003,"小黄鱼"]
[{"$nulls":3},5053,"章鱼",1,120,{"$nulls":7},5004,"泡泡鱼"]
[{"$nulls":3},5057,"美人鱼",null,80,{"$nulls":7},5005,"小紫鱼"]
[{"$nulls":3},5058,"船",1,100,{"$nulls":7},5006,"尼莫"]
[{"$nulls":3},6001,"金蟾",1,300,{"$nulls":7},5007,"河豚"]
[{"$nulls":3},6002,"炼丹炉(随机炸弹)",1,100,{"$nulls":7},5008,"蓝鱼"]
[{"$nulls":3},6003,"全屏炸弹",1,100,{"$nulls":7},5009,"灯笼鱼"]
[{"$nulls":3},6052,"两种同类鱼",1,100,{"$nulls":7},5010,"乌龟"]
[{"$nulls":3},6053,"三种同类鱼",1,100,{"$nulls":7},5011,"神仙鱼"]
[{"$nulls":3},11001,"沙丁鱼",1,2,{"$nulls":7},5012,"蝴蝶鱼"]
[{"$nulls":3},11002,"小丑鱼",1,2,{"$nulls":7},5013,"孔雀鱼"]
[{"$nulls":3},11003,"蓝藻鱼",1,3,{"$nulls":7},5014,"剑鱼"]
[{"$nulls":3},11004,"红斗鱼",1,4,{"$nulls":7},5015,"蝙蝠鱼"]
[{"$nulls":3},11005,"蓝斗鱼",1,4,{"$nulls":7},5016,"海草"]
[{"$nulls":3},11006,"小墨鱼",1,5,{"$nulls":7},5017,"大白鲨"]
[{"$nulls":3},11007,"气球鱼",1,5,{"$nulls":7},5018,"大金鲨"]
[{"$nulls":3},11008,"粉水母",1,8,{"$nulls":7},5051,"企鹅"]
[{"$nulls":3},11009,"螃蟹",1,8,{"$nulls":7},5052,"蓝海豚"]
[{"$nulls":3},11010,"灯笼鱼",1,10,{"$nulls":7},5053,"章鱼"]
[{"$nulls":3},11011,"乌龟",1,10,{"$nulls":7},5054,"银龙"]
[{"$nulls":3},11012,"神仙鱼",1,12,{"$nulls":7},5055,"金龙"]
[{"$nulls":3},11013,"蝴蝶鱼",1,14,{"$nulls":7},5056,"金鲸"]
[{"$nulls":3},11014,"海星",1,16,{"$nulls":7},5057,"美人鱼"]
[{"$nulls":3},11015,"剑鱼",1,18,{"$nulls":7},5058,"船"]
{"$rows_left_out":129}
{"sheet":"Sheet3","index":2,"n_rows":12,"n_cols":10,"rows_kept":12}
[1001,2,"蝴蝶鱼",2,{"$f":"VLOOKUP(A1,Sheet3!A$1:D$12,4,FALSE)","v":2},"1|1","1|1",13000,0,0]
[1002,2,"双色草莓鱼",2,{"$f":"VLOOKUP(A2,Sheet3!A$1:D$12,4,FALSE)","v":2},"1|2","1|1",13000,0,0]
[1003,2,"小黄鱼",3,{"$f":"VLOOKUP(A3,Sheet3!A$1:D$12,4,FALSE)","v":3},"1|3","1|2",13000,0,0]
[1004,2,"小锦鲤",4,{"$f":"VLOOKUP(A4,Sheet3!A$1:D$12,4,FALSE)","v":4},"2|3","1|2",13000,0,0]
[1001,3,"蝴蝶鱼",2,{"$f":"VLOOKUP(A5,Sheet3!A$1:D$12,4,FALSE)","v":2},"1|1","1|1",13000,0,0]
[1002,3,"双色草莓鱼",2,{"$f":"VLOOKUP(A6,Sheet3!A$1:D$12,4,FALSE)","v":2},"1|2","1|1",13000,0,0]
[1003,3,"小黄鱼",3,{"$f":"VLOOKUP(A7,Sheet3!A$1:D$12,4,FALSE)","v":3},"1|3","1|2",13000,0,0]
[1004,3,"小锦鲤",4,{"$f":"VLOOKUP(A8,Sheet3!A$1:D$12,4,FALSE)","v":4},"2|3","1|2",13000,0,0]
[1001,4,"蝴蝶鱼",2,{"$f":"VLOOKUP(A9,Sheet3!A$1:D$12,4,FALSE)","v":2},"1|1","1|1",13000,0,0]
[1002,4,"双色草莓鱼",2,{"$f":"VLOOKUP(A10,Sheet3!A$1:D$12,4,FALSE)","v":2},"1|2","1|1",13000,0,0]
[1003,4,"小黄鱼",3,{"$f":"VLOOKUP(A11,Sheet3!A$1:D$12,4,FALSE)","v":3},"1|3","1|2",13000,0,0]
[1004,4,"小锦鲤",4,{"$f":"VLOOKUP(A12,Sheet3!A$1:D$12,4,FALSE)","v":4},"2|3","1|2",13000,0,10004]